Target
Prostaglandin G/H synthase 1
Ligand
BDBM50322875
Substrate
Meas. Tech.
ChEMBL_644674 (CHEMBL1211653)
IC50
11300±n/a nM
Citation
 Abdellatif, KRChowdhury, MAVelázquez, CAHuang, ZDong, YDas, DYu, GSuresh, MRKnaus, EE Celecoxib prodrugs possessing a diazen-1-ium-1,2-diolate nitric oxide donor moiety: synthesis, biological evaluation and nitric oxide release studies. Bioorg Med Chem Lett 20:4544-9 (2010)  
Target
Name:
Prostaglandin G/H synthase 1
Synonyms:
COX1 Cyclooxygenase-1 (COX-1) PTGS1 | Prostaglandin G/H synthase (cyclooxygenase)
Type:
Protein
Mol. Mass.:
68868.60
Organism:
Ovis aries (Sheep)
Description:
Residue:
600
  
Inhibitor
Name:
BDBM50322875
Synonyms:
5-[4-(O2-(1-Acetoxyethy)diazen-1-ium-1,2-diolato)phenyl]-1-(4-sulfamoylphenyl)-3-trifluoromethyl-1H-pyrazole | CHEMBL1210074
Type:
Small organic molecule
Emp. Form.:
C20H18F3N5O6S
Mol. Mass.:
513.447
SMILES:
CC(O\N=[N+](\[O-])c1ccc(cc1)-c1cc(nn1-c1ccc(cc1)S(N)(=O)=O)C(F)(F)F)OC(C)=O
: