Target
Prostaglandin G/H synthase 2
Ligand
BDBM50322871
Substrate
Meas. Tech.
ChEMBL_644675 (CHEMBL1211654)
IC50
6100±n/a nM
Citation
 Abdellatif, KRChowdhury, MAVelázquez, CAHuang, ZDong, YDas, DYu, GSuresh, MRKnaus, EE Celecoxib prodrugs possessing a diazen-1-ium-1,2-diolate nitric oxide donor moiety: synthesis, biological evaluation and nitric oxide release studies. Bioorg Med Chem Lett 20:4544-9 (2010)  
Target
Name:
Prostaglandin G/H synthase 2
Synonyms:
COX2 Cyclooxygenase 2 (COX-2) Cyclooxygenase-2 (COX-2 AA) Cyclooxygenase-2 (COX-2) PGH2_HUMAN PHS II Prostaglandin E synthase/G/H synthase 2 Prostaglandin-endoperoxide synthase 2
Type:
Enzyme
Mol. Mass.:
69003.89
Organism:
Homo sapiens (Human)
Description:
Recombinant Cox-2 provided by Cayman (Cayman Chemical Co.,Ann Arbor, MI).
Residue:
604
  
Inhibitor
Name:
BDBM50322871
Synonyms:
5-[4-(O2-Ammonium diazen-1-ium-1,2-diolato)phenyl]-1-(4-sulfamoylphenyl)-3-trifluoromethyl-1H-pyrazole | CHEMBL1210017
Type:
Small organic molecule
Emp. Form.:
C16H11F3N5O4S
Mol. Mass.:
426.35
SMILES:
NS(=O)(=O)c1ccc(cc1)-n1nc(cc1-c1ccc(cc1)N([O-])N=O)C(F)(F)F
: