Target
Voltage-dependent T-type calcium channel subunit alpha-1H
Ligand
BDBM50322966
Substrate
Meas. Tech.
ChEMBL_643451 (CHEMBL1212315)
IC50
78±n/a nM
Citation
 Smith, EMSorota, SKim, HMMcKittrick, BANechuta, TLBennett, CKnutson, CBurnett, DAKieselgof, JTan, ZRindgen, DBridal, TZhou, XJia, YPDong, ZMullins, DZhang, XPriestley, TCorrell, CCTulshian, DCzarniecki, MGreenlee, WJ T-type calcium channel blockers: spiro-piperidine azetidines and azetidinones-optimization, design and synthesis. Bioorg Med Chem Lett 20:4602-6 (2010)  
Target
Name:
Voltage-dependent T-type calcium channel subunit alpha-1H
Synonyms:
CAC1H_HUMAN Low-voltage-activated calcium channel alpha1 3.2 subunit Voltage-gated calcium channel voltage-dependent T-type calcium channel subunit alpha-1H isoform a
Type:
Enzyme Catalytic Domain
Mol. Mass.:
259187.68
Organism:
Homo sapiens (Human)
Description:
Calcium channel (Type T,L) 0 0::O95180
Residue:
2353
  
Inhibitor
Name:
BDBM50322966
Synonyms:
7-(6-chloro-1H-benzo[d]imidazol-2-yl)-2-(3-chloro-4-fluorophenyl)-3-(pyridin-2-yl)-2,7-diazaspiro[3.5]nonan-1-one | CHEMBL1210900
Type:
Small organic molecule
Emp. Form.:
C25H20Cl2FN5O
Mol. Mass.:
496.364
SMILES:
Fc1ccc(cc1Cl)N1C(c2ccccn2)C2(CCN(CC2)c2nc3ccc(Cl)cc3[nH]2)C1=O
: