Target
Somatostatin receptor type 5
Ligand
BDBM50322988
Substrate
Meas. Tech.
ChEMBL_643471 (CHEMBL1212335)
Ki
4±n/a nM
Citation
 Alker, ABinggeli, AChrist, ADGreen, LMaerki, HPMartin, REMohr, P Piperidinyl-nicotinamides as potent and selective somatostatin receptor subtype 5 antagonists. Bioorg Med Chem Lett 20:4521-5 (2010)  
Target
Name:
Somatostatin receptor type 5
Synonyms:
SOMATOSTATIN SST5 SS5-R SSR5_HUMAN Somatostatin receptor type 5 (SSTR5)
Type:
Enzyme
Mol. Mass.:
39218.02
Organism:
Homo sapiens (Human)
Description:
P35346
Residue:
364
  
Inhibitor
Name:
BDBM50322988
Synonyms:
CHEMBL1210084 | N-(1-(3,5-diethoxy-4-methylbenzyl)piperidin-4-yl)-5-methylnicotinamide
Type:
Small organic molecule
Emp. Form.:
C24H33N3O3
Mol. Mass.:
411.5371
SMILES:
CCOc1cc(CN2CCC(CC2)NC(=O)c2cncc(C)c2)cc(OCC)c1C
: