Target
Serine/threonine-protein kinase PLK1
Ligand
BDBM50323097
Substrate
Meas. Tech.
ChEMBL_643706 (CHEMBL1212570)
IC50
1±n/a nM
Citation
 Rheault, TRDonaldson, KHBadiang-Alberti, JGDavis-Ward, RGAndrews, CWBambal, RJackson, JRCheung, M Heteroaryl-linked 5-(1H-benzimidazol-1-yl)-2-thiophenecarboxamides: potent inhibitors of polo-like kinase 1 (PLK1) with improved drug-like properties. Bioorg Med Chem Lett 20:4587-92 (2010)  
Target
Name:
Serine/threonine-protein kinase PLK1
Synonyms:
PLK PLK1 Polo-like kinase 1 (PlK1) STPK13 Serine/threonine-protein kinase 13 | polo-like kinase
Type:
Serine/threonine-protein kinase
Mol. Mass.:
68277.16
Organism:
Homo sapiens (Human)
Description:
P53350
Residue:
603
  
Inhibitor
Name:
BDBM50323097
Synonyms:
(R)-3-(1-(2-chlorophenyl)ethoxy)-5-(5-(2-(2-hydroxyethylamino)pyridin-4-yl)-1H-benzo[d]imidazol-1-yl)thiophene-2-carboxamide | CHEMBL1208963
Type:
Small organic molecule
Emp. Form.:
C27H24ClN5O3S
Mol. Mass.:
534.029
SMILES:
C[C@@H](Oc1cc(sc1C(N)=O)-n1cnc2cc(ccc12)-c1ccnc(NCCO)c1)c1ccccc1Cl
: