Target
Serine/threonine-protein kinase PLK1
Ligand
BDBM50323099
Substrate
Meas. Tech.
ChEMBL_643706 (CHEMBL1212570)
IC50
2±n/a nM
Citation
 Rheault, TRDonaldson, KHBadiang-Alberti, JGDavis-Ward, RGAndrews, CWBambal, RJackson, JRCheung, M Heteroaryl-linked 5-(1H-benzimidazol-1-yl)-2-thiophenecarboxamides: potent inhibitors of polo-like kinase 1 (PLK1) with improved drug-like properties. Bioorg Med Chem Lett 20:4587-92 (2010)  
Target
Name:
Serine/threonine-protein kinase PLK1
Synonyms:
PLK PLK1 Polo-like kinase 1 (PlK1) STPK13 Serine/threonine-protein kinase 13 | polo-like kinase
Type:
Serine/threonine-protein kinase
Mol. Mass.:
68277.16
Organism:
Homo sapiens (Human)
Description:
P53350
Residue:
603
  
Inhibitor
Name:
BDBM50323099
Synonyms:
(R)-3-(1-(2-chlorophenyl)ethoxy)-5-(5-(6-(1-methylpiperidin-4-ylamino)pyridin-3-yl)-1H-benzo[d]imidazol-1-yl)thiophene-2-carboxamide | CHEMBL1208965
Type:
Small organic molecule
Emp. Form.:
C31H31ClN6O2S
Mol. Mass.:
587.135
SMILES:
C[C@@H](Oc1cc(sc1C(N)=O)-n1cnc2cc(ccc12)-c1ccc(NC2CCN(C)CC2)nc1)c1ccccc1Cl
: