Target
Serine/threonine-protein kinase PLK1
Ligand
BDBM50323106
Substrate
Meas. Tech.
ChEMBL_643706 (CHEMBL1212570)
IC50
1±n/a nM
Citation
 Rheault, TRDonaldson, KHBadiang-Alberti, JGDavis-Ward, RGAndrews, CWBambal, RJackson, JRCheung, M Heteroaryl-linked 5-(1H-benzimidazol-1-yl)-2-thiophenecarboxamides: potent inhibitors of polo-like kinase 1 (PLK1) with improved drug-like properties. Bioorg Med Chem Lett 20:4587-92 (2010)  
Target
Name:
Serine/threonine-protein kinase PLK1
Synonyms:
PLK PLK1 Polo-like kinase 1 (PlK1) STPK13 Serine/threonine-protein kinase 13 | polo-like kinase
Type:
Serine/threonine-protein kinase
Mol. Mass.:
68277.16
Organism:
Homo sapiens (Human)
Description:
P53350
Residue:
603
  
Inhibitor
Name:
BDBM50323106
Synonyms:
(R)-3-(1-(2-chlorophenyl)ethoxy)-5-(5-(1-(2-morpholinoethyl)-1H-pyrazol-4-yl)-1H-benzo[d]imidazol-1-yl)thiophene-2-carboxamide | CHEMBL1209015
Type:
Small organic molecule
Emp. Form.:
C29H29ClN6O3S
Mol. Mass.:
577.097
SMILES:
C[C@@H](Oc1cc(sc1C(N)=O)-n1cnc2cc(ccc12)-c1cnn(CCN2CCOCC2)c1)c1ccccc1Cl
: