Target
Serine/threonine-protein kinase PLK3
Ligand
BDBM50323114
Substrate
Meas. Tech.
ChEMBL_643707 (CHEMBL1212571)
IC50
16±n/a nM
Citation
 Rheault, TRDonaldson, KHBadiang-Alberti, JGDavis-Ward, RGAndrews, CWBambal, RJackson, JRCheung, M Heteroaryl-linked 5-(1H-benzimidazol-1-yl)-2-thiophenecarboxamides: potent inhibitors of polo-like kinase 1 (PLK1) with improved drug-like properties. Bioorg Med Chem Lett 20:4587-92 (2010)  
Target
Name:
Serine/threonine-protein kinase PLK3
Synonyms:
CNK FGF-inducible kinase PLK3 PRK Proliferation-related kinase | Serine/threonine-protein kinase PLK3
Type:
Serine/threonine-protein kinase
Mol. Mass.:
71655.17
Organism:
Homo sapiens (Human)
Description:
Enzyme assays were using PLK3 purified from baculovirus-infected Trichoplusia ni cells expressing full-length PLK3.
Residue:
646
  
Inhibitor
Name:
BDBM50323114
Synonyms:
(R)-5-(6-(pyridin-4-yl)-1H-benzo[d]imidazol-1-yl)-3-(1-(2-(trifluoromethyl)phenyl)ethoxy)thiophene-2-carboxamide | CHEMBL1209606
Type:
Small organic molecule
Emp. Form.:
C26H19F3N4O2S
Mol. Mass.:
508.515
SMILES:
C[C@@H](Oc1cc(sc1C(N)=O)-n1cnc2ccc(cc12)-c1ccncc1)c1ccccc1C(F)(F)F
: