Target
Cytochrome P450 3A4
Ligand
BDBM50323345
Substrate
Meas. Tech.
ChEMBL_643970 (CHEMBL1211869)
IC50
490±n/a nM
Citation
 Adams, CMHu, CWJeng, AYKarki, RKsander, GLasala, DLeung-Chu, JLiang, GLiu, QMeredith, ERao, CRigel, DFShi, JSmith, SSpringer, CZhang, C The discovery of potent inhibitors of aldosterone synthase that exhibit selectivity over 11-beta-hydroxylase. Bioorg Med Chem Lett 20:4324-7 (2010)  
Target
Name:
Cytochrome P450 3A4
Synonyms:
Albendazole monooxygenase CP3A4_HUMAN CYP3A4 CYPIIIA4 Cytochrome P450 3A4 (CYP3A4) Nifedipine oxidase Taurochenodeoxycholate 6-alpha-hydroxylase
Type:
Enzyme
Mol. Mass.:
57349.57
Organism:
Homo sapiens (Human)
Description:
Residue:
503
  
Inhibitor
Name:
BDBM50323345
Synonyms:
4-Isobutyl-6-(4-trifluoromethoxy-benzyl)-6,7-dihydro-5-thia-2,3a,6-triaza-indene 5,5-dioxide | CHEMBL1209555
Type:
Small organic molecule
Emp. Form.:
C17H20F3N3O3S
Mol. Mass.:
403.419
SMILES:
CC(C)CC1n2cncc2CN(Cc2ccc(OC(F)(F)F)cc2)S1(=O)=O
: