Target
Cytochrome P450 3A4
Ligand
BDBM50323344
Substrate
Meas. Tech.
ChEMBL_643969 (CHEMBL1211868)
IC50
100±n/a nM
Citation
 Adams, CMHu, CWJeng, AYKarki, RKsander, GLasala, DLeung-Chu, JLiang, GLiu, QMeredith, ERao, CRigel, DFShi, JSmith, SSpringer, CZhang, C The discovery of potent inhibitors of aldosterone synthase that exhibit selectivity over 11-beta-hydroxylase. Bioorg Med Chem Lett 20:4324-7 (2010)  
Target
Name:
Cytochrome P450 3A4
Synonyms:
Albendazole monooxygenase CP3A4_HUMAN CYP3A4 CYPIIIA4 Cytochrome P450 3A4 (CYP3A4) Nifedipine oxidase Taurochenodeoxycholate 6-alpha-hydroxylase
Type:
Enzyme
Mol. Mass.:
57349.57
Organism:
Homo sapiens (Human)
Description:
Residue:
503
  
Inhibitor
Name:
BDBM50323344
Synonyms:
6-Benzyl-4-isobutyl-6,7-dihydro-5-thia-2,3a,6-triaza-indene 5,5-dioxide | CHEMBL1209554
Type:
Small organic molecule
Emp. Form.:
C16H21N3O2S
Mol. Mass.:
319.422
SMILES:
CC(C)CC1n2cncc2CN(Cc2ccccc2)S1(=O)=O
: