Target
Neuropeptide Y receptor type 5
Ligand
BDBM50416448
Substrate
Meas. Tech.
ChEMBL_644140 (CHEMBL1212039)
Ki
0.398±n/a nM
Citation
 Biagetti, MLeslie, CPMazzali, ASeri, CPizzi, DABentley, JGenski, TDi Fabio, RZonzini, LCaberlotto, L Synthesis and structure-activity relationship of N-(3-azabicyclo[3.1.0]hex-6-ylmethyl)-5-(2-pyridinyl)-1,3-thiazol-2-amines derivatives as NPY Y5 antagonists. Bioorg Med Chem Lett 20:4741-4 (2010)  
Target
Name:
Neuropeptide Y receptor type 5
Synonyms:
NPY-Y5 NPY5-R NPY5R_HUMAN NPYY5 Neuropeptide Y receptor type 5 ( NPY Y5) | Y5 receptor
Type:
Enzyme
Mol. Mass.:
50746.64
Organism:
Homo sapiens (Human)
Description:
Q15761
Residue:
445
  
Inhibitor
Name:
BDBM50416448
Synonyms:
CHEMBL1209159
Type:
Small organic molecule
Emp. Form.:
C23H24N4OS
Mol. Mass.:
404.528
SMILES:
CC(C(=O)N1C[C@H]2[C@@H](CNc3nc(cs3)-c3ccccn3)[C@H]2C1)c1ccccc1
: