Target
High affinity choline transporter 1
Ligand
BDBM50060526
Substrate
Meas. Tech.
ChEMBL_644789 (CHEMBL1211032)
Ki
55718.57±n/a nM
Citation
 Geldenhuys, WJAllen, DDLockman, PR 3-D-QSAR and docking studies on the neuronal choline transporter. Bioorg Med Chem Lett 20:4870-7 (2010)  
Target
Name:
High affinity choline transporter 1
Synonyms:
Choline transporter SC5A7_MOUSE | Slc5a7
Type:
PROTEIN
Mol. Mass.:
63358.06
Organism:
Mus musculus
Description:
ChEMBL_644789
Residue:
580
  
Inhibitor
Name:
BDBM50060526
Synonyms:
2-Dimethylamino-ethanol CHEMBL1135 | N,N-Dimethylaminoethanol (Dmae)
Type:
Small organic molecule
Emp. Form.:
C4H11NO
Mol. Mass.:
89.1362
SMILES:
CN(C)CCO
: