Target
Bile acid receptor
Ligand
BDBM50323536
Substrate
Meas. Tech.
ChEMBL_644899 (CHEMBL1211229)
EC50
242±n/a nM
Citation
 Abel, USchlüter, TSchulz, AHambruch, ESteeneck, CHornberger, MHoffmann, TPerovic-Ottstadt, SKinzel, OBurnet, MDeuschle, UKremoser, C Synthesis and pharmacological validation of a novel series of non-steroidal FXR agonists. Bioorg Med Chem Lett 20:4911-7 (2010)  
Target
Name:
Bile acid receptor
Synonyms:
BAR FXR HRR1 NR1H4_HUMAN RIP14 Retinoid X receptor-interacting protein 14 | farnesoid x receptor
Type:
Nuclear Receptor
Mol. Mass.:
55916.24
Organism:
Homo sapiens (Human)
Description:
Q96RI1
Residue:
486
  
Inhibitor
Name:
BDBM50323536
Synonyms:
4-(((3-chloro-5-((3-(2,6-dichlorophenyl)-5-isopropylisoxazol-4-yl)methoxy)pyridin-2-yl)(methyl)amino)methyl)benzoic acid | CHEMBL1209227
Type:
Small organic molecule
Emp. Form.:
C27H24Cl3N3O4
Mol. Mass.:
560.856
SMILES:
CC(C)c1onc(c1COc1cnc(N(C)Cc2ccc(cc2)C(O)=O)c(Cl)c1)-c1c(Cl)cccc1Cl
: