Target
Bile acid receptor
Ligand
BDBM50323545
Substrate
Meas. Tech.
ChEMBL_644901 (CHEMBL1211231)
EC50
225±n/a nM
Citation
 Abel, USchlüter, TSchulz, AHambruch, ESteeneck, CHornberger, MHoffmann, TPerovic-Ottstadt, SKinzel, OBurnet, MDeuschle, UKremoser, C Synthesis and pharmacological validation of a novel series of non-steroidal FXR agonists. Bioorg Med Chem Lett 20:4911-7 (2010)  
Target
Name:
Bile acid receptor
Synonyms:
BAR FXR HRR1 NR1H4_HUMAN RIP14 Retinoid X receptor-interacting protein 14 | farnesoid x receptor
Type:
Nuclear Receptor
Mol. Mass.:
55916.24
Organism:
Homo sapiens (Human)
Description:
Q96RI1
Residue:
486
  
Inhibitor
Name:
BDBM50323545
Synonyms:
3-(2,6-dichlorophenyl)-5-isopropyl-4-((6-methyl-4-(trifluoromethyl)pyridin-2-yloxy)methyl)isoxazole | CHEMBL1209061
Type:
Small organic molecule
Emp. Form.:
C20H17Cl2F3N2O2
Mol. Mass.:
445.262
SMILES:
CC(C)c1onc(c1COc1cc(cc(C)n1)C(F)(F)F)-c1c(Cl)cccc1Cl
: