Target
Progesterone receptor
Ligand
BDBM50323530
Substrate
Meas. Tech.
ChEMBL_644944 (CHEMBL1211330)
EC50
>10000±n/a nM
Citation
 Abel, USchlüter, TSchulz, AHambruch, ESteeneck, CHornberger, MHoffmann, TPerovic-Ottstadt, SKinzel, OBurnet, MDeuschle, UKremoser, C Synthesis and pharmacological validation of a novel series of non-steroidal FXR agonists. Bioorg Med Chem Lett 20:4911-7 (2010)  
Target
Name:
Progesterone receptor
Synonyms:
NR3C3 PGR PRGR_HUMAN | progesterone
Type:
Protein
Mol. Mass.:
98979.52
Organism:
Homo sapiens (Human)
Description:
P06401
Residue:
933
  
Inhibitor
Name:
BDBM50323530
Synonyms:
3-(((6-((5-cyclopropyl-3-(2,6-dichlorophenyl)isoxazol-4-yl)methoxy)-2-(trifluoromethyl)pyridin-3-yl)(methyl)amino)methyl)benzoic acid | CHEMBL1209170
Type:
Small organic molecule
Emp. Form.:
C28H22Cl2F3N3O4
Mol. Mass.:
592.393
SMILES:
CN(Cc1cccc(c1)C(O)=O)c1ccc(OCc2c(onc2-c2c(Cl)cccc2Cl)C2CC2)nc1C(F)(F)F
: