Target
Retinoic acid receptor gamma
Ligand
BDBM50323524
Substrate
Meas. Tech.
ChEMBL_644953 (CHEMBL1211339)
EC50
>10000±n/a nM
Citation
 Abel, USchlüter, TSchulz, AHambruch, ESteeneck, CHornberger, MHoffmann, TPerovic-Ottstadt, SKinzel, OBurnet, MDeuschle, UKremoser, C Synthesis and pharmacological validation of a novel series of non-steroidal FXR agonists. Bioorg Med Chem Lett 20:4911-7 (2010)  
Target
Name:
Retinoic acid receptor gamma
Synonyms:
NR1B3 RAR-gamma RARG_HUMAN Retinoic acid receptor gamma | Retinoid receptor
Type:
PROTEIN
Mol. Mass.:
50345.43
Organism:
Homo sapiens (Human)
Description:
ChEMBL_1458016
Residue:
454
  
Inhibitor
Name:
BDBM50323524
Synonyms:
4-(((6-((3-(2,6-dichlorophenyl)-5-isopropylisoxazol-4-yl)methoxy)-2-(trifluoromethyl)pyridin-3-yl)(methyl)amino)methyl)benzoic acid | CHEMBL1209109
Type:
Small organic molecule
Emp. Form.:
C28H24Cl2F3N3O4
Mol. Mass.:
594.409
SMILES:
CC(C)c1onc(c1COc1ccc(N(C)Cc2ccc(cc2)C(O)=O)c(n1)C(F)(F)F)-c1c(Cl)cccc1Cl
: