Target
Nuclear receptor subfamily 1 group I member 3
Ligand
BDBM50323533
Substrate
Meas. Tech.
ChEMBL_644954 (CHEMBL1211340)
EC50
>10000±n/a nM
Citation
 Abel, USchlüter, TSchulz, AHambruch, ESteeneck, CHornberger, MHoffmann, TPerovic-Ottstadt, SKinzel, OBurnet, MDeuschle, UKremoser, C Synthesis and pharmacological validation of a novel series of non-steroidal FXR agonists. Bioorg Med Chem Lett 20:4911-7 (2010)  
Target
Name:
Nuclear receptor subfamily 1 group I member 3
Synonyms:
CAR NR1I3_HUMAN
Type:
PROTEIN
Mol. Mass.:
39953.17
Organism:
Homo sapiens (Human)
Description:
ChEMBL_1434936
Residue:
352
  
Inhibitor
Name:
BDBM50323533
Synonyms:
4-(((6-((5-cyclopropyl-3-(2,6-dichlorophenyl)isoxazol-4-yl)methoxy)-2-(trifluoromethyl)pyridin-3-yl)(methyl)amino)methyl)benzoic acid | CHEMBL1209173
Type:
Small organic molecule
Emp. Form.:
C28H22Cl2F3N3O4
Mol. Mass.:
592.393
SMILES:
CN(Cc1ccc(cc1)C(O)=O)c1ccc(OCc2c(onc2-c2c(Cl)cccc2Cl)C2CC2)nc1C(F)(F)F
: