Target
MAP kinase-activated protein kinase 2
Ligand
BDBM50323635
Substrate
Meas. Tech.
ChEMBL_645050 (CHEMBL1211556)
Ki
96±n/a nM
Citation
 Olsson, HSjö, PErsoy, OKristoffersson, ALarsson, JNordén, B 4-Anilino-6-phenyl-quinoline inhibitors of mitogen activated protein kinase-activated protein kinase 2 (MK2). Bioorg Med Chem Lett 20:4738-40 (2010)  
Target
Name:
MAP kinase-activated protein kinase 2
Synonyms:
MAP kinase-activated protein kinase 2 (MAPKAPK2) MAP kinase-activated protein kinase 2 (p38/MK2) MAPK-activated protein kinase 2 MAPKAP kinase 2 MAPKAPK2 | MK2
Type:
Serine/threonine-protein kinase
Mol. Mass.:
45579.87
Organism:
Homo sapiens (Human)
Description:
P49137
Residue:
400
  
Inhibitor
Name:
BDBM50323635
Synonyms:
6-(4-chlorophenyl)-N-(4-(4-methylpiperazin-1-yl)phenyl)quinolin-4-amine | CHEMBL1208951
Type:
Small organic molecule
Emp. Form.:
C26H25ClN4
Mol. Mass.:
428.957
SMILES:
CN1CCN(CC1)c1ccc(Nc2ccnc3ccc(cc23)-c2ccc(Cl)cc2)cc1
: