Target
Carbapenem-hydrolyzing beta-lactamase KPC
Ligand
BDBM50053173
Substrate
Meas. Tech.
ChEMBL_645841 (CHEMBL1218087)
IC50
370±n/a nM
Citation
 Girlich, DPoirel, LNordmann, P Novel ambler class A carbapenem-hydrolyzing beta-lactamase from a Pseudomonas fluorescens isolate from the Seine River, Paris, France. Antimicrob Agents Chemother 54:328-32 (2009)  
Target
Name:
Carbapenem-hydrolyzing beta-lactamase KPC
Synonyms:
BLKPC_KLEPN bla kpc1
Type:
PROTEIN
Mol. Mass.:
31116.99
Organism:
Klebsiella pneumoniae
Description:
ChEMBL_645841
Residue:
293
  
Inhibitor
Name:
BDBM50053173
Synonyms:
(2S,3S,5R)-3-Methyl-4,4,7-trioxo-3-[1,2,3]triazol-1-ylmethyl-4-thia-1-aza-bicyclo[3.2.0]heptane-2-carboxylic acid (2S,3S,5R)-3-methyl-4,4,7-trioxo-3-[1,2,3]triazol-1-ylmethyl-4lambda6-thia-1-aza-bicyclo[3.2.0]heptane-2-carboxylic acid 3-Methyl-4,4,7-trioxo-3-[1,2,3]triazol-1-ylmethyl-4lambda*6*-thia-1-aza-bicyclo[3.2.0]heptane-2-carboxylic acid CL-298741 US9120808, Tazobactam sodium salt YTR-830H | Zosyn
Type:
Small organic molecule
Emp. Form.:
C10H12N4O5S
Mol. Mass.:
300.291
SMILES:
C[C@]1(Cn2ccnn2)[C@@H](N2[C@@H](CC2=O)S1(=O)=O)C(O)=O
: