Target
Glutamate receptor ionotropic, kainate 3
Ligand
BDBM86751
Substrate
Meas. Tech.
ChEMBL_646899 (CHEMBL1217040)
Ki
>100000±n/a nM
Citation
 Mattes, HCarcache, DKalkman, HOKoller, M alpha-Amino-3-hydroxy-5-methyl-4-isoxazolepropionic acid (AMPA) antagonists: from bench to bedside. J Med Chem 53:5367-82 (2010)  
Target
Name:
Glutamate receptor ionotropic, kainate 3
Synonyms:
EAA5 GLUR7 GRIK3_HUMAN Glutamate receptor 7 Glutamate receptor ionotropic kainate 3 Glutamate-Kainate 7
Type:
Enzyme Catalytic Domain
Mol. Mass.:
104046.44
Organism:
Homo sapiens (Human)
Description:
Glutamate-Kainate 7 0 HUMAN::Q13003
Residue:
919
  
Inhibitor
Name:
BDBM86751
Synonyms:
CHEMBL14935 LY-293558
Type:
Small organic molecule
Emp. Form.:
C13H21N5O2
Mol. Mass.:
279.3381
SMILES:
OC(=O)[C@@H]1C[C@H]2C[C@@H](CCc3nnn[nH]3)CC[C@H]2CN1
: