Target
Carbonic anhydrase 6
Ligand
BDBM50323741
Substrate
Meas. Tech.
ChEMBL_646959 (CHEMBL1217100)
Ki
740±n/a nM
Citation
 Carta, FTemperini, CInnocenti, AScozzafava, AKaila, KSupuran, CT Polyamines inhibit carbonic anhydrases by anchoring to the zinc-coordinated water molecule. J Med Chem 53:5511-22 (2010)  
Target
Name:
Carbonic anhydrase 6
Synonyms:
CA-VI CAH6_HUMAN Carbonic Anhydrase VI Carbonic anhydrase 6 Carbonic anhydrase 6 (CA-VI) Salivary carbonic anhydrase | Secreted carbonic anhydrase
Type:
Enzyme
Mol. Mass.:
35371.40
Organism:
Homo sapiens (Human)
Description:
P23280
Residue:
308
  
Inhibitor
Name:
BDBM50323741
Synonyms:
CHEMBL119296
Type:
Small organic molecule
Emp. Form.:
C5H14N2
Mol. Mass.:
102.1781
SMILES:
NCCCCCN
: