Target
Carbonic anhydrase 5A, mitochondrial
Ligand
BDBM50323751
Substrate
Meas. Tech.
ChEMBL_646957 (CHEMBL1217098)
Ki
38000±n/a nM
Citation
 Carta, FTemperini, CInnocenti, AScozzafava, AKaila, KSupuran, CT Polyamines inhibit carbonic anhydrases by anchoring to the zinc-coordinated water molecule. J Med Chem 53:5511-22 (2010)  
Target
Name:
Carbonic anhydrase 5A, mitochondrial
Synonyms:
CA-VA CA5A Carbonate dehydratase VA Carbonic anhydrase 5A (CA VA) Carbonic anhydrase 5A, mitochondrial precursor Carbonic anhydrase VA (CA VA)
Type:
Enzyme
Mol. Mass.:
34755.54
Organism:
Homo sapiens (Human)
Description:
Human (cloned) isozyme
Residue:
305
  
Inhibitor
Name:
BDBM50323751
Synonyms:
CHEMBL609 N,N'-Bis-(2-amino-ethyl)-ethane-1,2-diamine TRIENTINE | triethylenetetramine
Type:
Small organic molecule
Emp. Form.:
C6H18N4
Mol. Mass.:
146.2339
SMILES:
NCCNCCNCCN
: