Target
Tyrosine-protein kinase ABL1
Ligand
BDBM13530
Substrate
Meas. Tech.
ChEMBL_647651 (CHEMBL1220002)
IC50
10.8±n/a nM
Citation
 Dietrich, JHulme, CHurley, LH The design, synthesis, and evaluation of 8 hybrid DFG-out allosteric kinase inhibitors: a structural analysis of the binding interactions of Gleevec, Nexavar, and BIRB-796. Bioorg Med Chem 18:5738-48 (2010)  
Target
Name:
Tyrosine-protein kinase ABL1
Synonyms:
ABL1_MOUSE Abelson tyrosine-protein kinase 1 Abl1 p150
Type:
PROTEIN
Mol. Mass.:
122698.35
Organism:
Mus musculus
Description:
ChEMBL_767349
Residue:
1123
  
Inhibitor
Name:
BDBM13530
Synonyms:
4-[(4-methylpiperazin-1-yl)methyl]-N-[4-methyl-3-[(4-pyridin-3-ylpyrimidin-2-yl)amino]phenyl]benzamide Gleevec Imatinib, 21 STI-571 US10906896, Cpd imatinib US11725005, Compound imatinib cid_5291 med.21724, Compound 6
Type:
Small organic molecule
Emp. Form.:
C29H31N7O
Mol. Mass.:
493.6027
SMILES:
CN1CCN(Cc2ccc(cc2)C(=O)Nc2ccc(C)c(Nc3nccc(n3)-c3cccnc3)c2)CC1
: