Target
Phospholipase A2
Ligand
BDBM50250399
Substrate
Meas. Tech.
ChEMBL_647214 (CHEMBL1217355)
IC50
500±n/a nM
Citation
 Longeon, ACopp, BRRoué, MDubois, JValentin, APetek, SDebitus, CBourguet-Kondracki, ML New bioactive halenaquinone derivatives from South Pacific marine sponges of the genus Xestospongia. Bioorg Med Chem 18:6006-11 (2010)  
Target
Name:
Phospholipase A2
Synonyms:
Allergen Api m I PA2_APIME Phospholipase A2 (Bee)
Type:
PROTEIN
Mol. Mass.:
19061.47
Organism:
Apis mellifera
Description:
ChEMBL_1277435
Residue:
167
  
Inhibitor
Name:
BDBM50250399
Synonyms:
5-Hydroxy-4-{(R)-6-hydroxy-5-[(E)-4-methyl-6-(2,6,6-trimethyl-cyclohex-1-enyl)-hex-3-enyl]-3,6-dihydro-2H-pyran-2-yl}-5H-furan-2-one CHEMBL463914 | manoalide
Type:
Small organic molecule
Emp. Form.:
C25H36O5
Mol. Mass.:
416.5503
SMILES:
C\C(CCC1=C(C)CCCC1(C)C)=C/CCC1=CC[C@@H](O[C@H]1O)C1=CC(=O)O[C@H]1O
: