Target
Mu-type opioid receptor
Ligand
BDBM50272169
Substrate
Meas. Tech.
ChEMBL_647387 (CHEMBL1217548)
IC50
1724±n/a nM
Citation
 Balboni, GMarzola, ESasaki, YAmbo, AMarczak, EDLazarus, LHSalvadori, S Role of 2',6'-dimethyl-l-tyrosine (Dmt) in some opioid lead compounds. Bioorg Med Chem 18:6024-30 (2010)  
Target
Name:
Mu-type opioid receptor
Synonyms:
M-OR-1 Mu opioid receptor OPIATE Mu OPRM_CAVPO
Type:
Enzyme Catalytic Domain
Mol. Mass.:
11165.58
Organism:
GUINEA PIG
Description:
P97266
Residue:
98
  
Inhibitor
Name:
BDBM50272169
Synonyms:
(S)-3-((S)-2-((S)-2-amino-3-(4-hydroxy-2,6-dimethylphenyl)propanoyl)-1,2,3,4-tetrahydroisoquinoline-3-carboxamido)-3-(1H-benzo[d]imidazol-2-yl)propanoic acid CHEMBL442577 UFP-512
Type:
Small organic molecule
Emp. Form.:
C31H33N5O5
Mol. Mass.:
555.6242
SMILES:
Cc1cc(O)cc(C)c1C[C@H](N)C(=O)N1Cc2ccccc2C[C@H]1C(=O)N[C@@H](CC(O)=O)c1nc2ccccc2[nH]1
: