Target
Serine/threonine-protein kinase D1
Ligand
BDBM50324346
Substrate
Meas. Tech.
ChEMBL_650173 (CHEMBL1219871)
EC50
17±n/a nM
Citation
 Meredith, ELBeattie, KBurgis, RCapparelli, MChapo, JDipietro, LGamber, GEnyedy, IHood, DBHosagrahara, VJewell, CKoch, KALee, WLemon, DDMcKinsey, TAMiranda, KPagratis, NPhan, DPlato, CRao, CRozhitskaya, OSoldermann, NSpringer, Cvan Eis, MVega, RBYan, WZhu, QMonovich, LG Identification of potent and selective amidobipyridyl inhibitors of protein kinase D. J Med Chem 53:5422-38 (2010)  
Target
Name:
Serine/threonine-protein kinase D1
Synonyms:
KPCD1_HUMAN PKD1 PRKD1 Protein kinase C mu type Protein kinase C, PKC; classical/novel Protein kinase D (PRKD1) nPKC-D1 | nPKC-mu
Type:
Serine/threonine-protein kinase
Mol. Mass.:
101705.07
Organism:
Homo sapiens (Human)
Description:
gi_115529463
Residue:
912
  
Inhibitor
Name:
BDBM50324346
Synonyms:
CHEMBL1215151 | Cyclohexyl-[6-piperazin-1-yl-4-(1H-pyrazol-4-yl)[2,4']bipyridinyl-2'-yl]amine
Type:
Small organic molecule
Emp. Form.:
C23H29N7
Mol. Mass.:
403.5233
SMILES:
C1CCC(CC1)Nc1cc(ccn1)-c1cc(cc(n1)N1CCNCC1)-c1cn[nH]c1
: