Target
Polycystin-2
Ligand
BDBM50324333
Substrate
Meas. Tech.
ChEMBL_650175 (CHEMBL1219873)
IC50
68±n/a nM
Citation
 Meredith, ELBeattie, KBurgis, RCapparelli, MChapo, JDipietro, LGamber, GEnyedy, IHood, DBHosagrahara, VJewell, CKoch, KALee, WLemon, DDMcKinsey, TAMiranda, KPagratis, NPhan, DPlato, CRao, CRozhitskaya, OSoldermann, NSpringer, Cvan Eis, MVega, RBYan, WZhu, QMonovich, LG Identification of potent and selective amidobipyridyl inhibitors of protein kinase D. J Med Chem 53:5422-38 (2010)  
Target
Name:
Polycystin-2
Synonyms:
PKD2 TRPP2
Type:
PROTEIN
Mol. Mass.:
109676.85
Organism:
Homo sapiens (Human)
Description:
ChEMBL_886731
Residue:
968
  
Inhibitor
Name:
BDBM50324333
Synonyms:
2'-(1-Methyl-1H-pyrazol-3-ylamino)-6-piperazin-1-yl[2,4']bipyridinyl-4-carbonitrile | CHEMBL1215150
Type:
Small organic molecule
Emp. Form.:
C19H20N8
Mol. Mass.:
360.4157
SMILES:
Cn1ccc(Nc2cc(ccn2)-c2cc(cc(n2)N2CCNCC2)C#N)n1
: