Target
Glutamate receptor ionotropic, NMDA 1/2C
Ligand
BDBM50324398
Substrate
Meas. Tech.
ChEMBL_650214 (CHEMBL1219912)
IC50
2000±n/a nM
Citation
 Mosley, CAAcker, TMHansen, KBMullasseril, PAndersen, KTLe, PVellano, KMBräuner-Osborne, HLiotta, DCTraynelis, SF Quinazolin-4-one derivatives: A novel class of noncompetitive NR2C/D subunit-selective N-methyl-D-aspartate receptor antagonists. J Med Chem 53:5476-90 (2010)  
Target
Name:
Glutamate receptor ionotropic, NMDA 1/2C
Synonyms:
Glutamate NMDA receptor; Grin1/Grin2c | Glutamate [NMDA] receptor subunit epsilon 3/zeta 1
Type:
Mol. Mass.:
Description:
ASSAY_ID of EBI is 141029
Components:
This complex has 2 components.
Component 1
Name:
Glutamate receptor ionotropic, NMDA 1
Synonyms:
Glutamate (NMDA) receptor subunit zeta 1 Glutamate-NMDA-Channel Glutamate-NMDA-Polyamine NMDA Nmdar1 | phencyclidine
Type:
Enzyme Catalytic Domain
Mol. Mass.:
105533.40
Organism:
RAT
Description:
P35439
Residue:
938
  
Component 2
Name:
Glutamate receptor ionotropic, NMDA 2C
Synonyms:
Glutamate NMDA receptor; Grin1/Grin2c Grin2c NMDE3_RAT
Type:
Protein
Mol. Mass.:
135305.94
Organism:
Rattus norvegicus (Rat)
Description:
Q00961
Residue:
1237
  
Inhibitor
Name:
BDBM50324398
Synonyms:
(E)-4-(6-Bromo-2-(3-nitrostyryl)-4-oxoquinazolin-3(4H)-yl)-benzoic Acid | CHEMBL1215227
Type:
Small organic molecule
Emp. Form.:
C23H14BrN3O5
Mol. Mass.:
492.278
SMILES:
OC(=O)c1ccc(cc1)-n1c(\C=C\c2cccc(c2)[N+]([O-])=O)nc2ccc(Br)cc2c1=O
: