Target
Glutamate receptor 1
Ligand
BDBM50324404
Substrate
Meas. Tech.
ChEMBL_650216 (CHEMBL1219914)
IC50
5000±n/a nM
Citation
 Mosley, CAAcker, TMHansen, KBMullasseril, PAndersen, KTLe, PVellano, KMBräuner-Osborne, HLiotta, DCTraynelis, SF Quinazolin-4-one derivatives: A novel class of noncompetitive NR2C/D subunit-selective N-methyl-D-aspartate receptor antagonists. J Med Chem 53:5476-90 (2010)  
Target
Name:
Glutamate receptor 1
Synonyms:
AMPA-selective glutamate receptor 1 GluA1 GluR-A Glur1 Gria1
Type:
Protein
Mol. Mass.:
101583.91
Organism:
Rattus norvegicus (Rat)
Description:
P19490
Residue:
907
  
Inhibitor
Name:
BDBM50324404
Synonyms:
(E)-4-(2-(3-Nitrostyryl)-4-oxo-6-phenylquinazolin-3(4H)-yl)-benzoic Acid | CHEMBL1215365
Type:
Small organic molecule
Emp. Form.:
C29H19N3O5
Mol. Mass.:
489.4783
SMILES:
OC(=O)c1ccc(cc1)-n1c(\C=C\c2cccc(c2)[N+]([O-])=O)nc2ccc(cc2c1=O)-c1ccccc1
: