Target
Glutamate receptor ionotropic, NMDA 1/2A
Ligand
BDBM50324473
Substrate
Meas. Tech.
ChEMBL_650211 (CHEMBL1219909)
IC50
4000±n/a nM
Citation
 Mosley, CAAcker, TMHansen, KBMullasseril, PAndersen, KTLe, PVellano, KMBräuner-Osborne, HLiotta, DCTraynelis, SF Quinazolin-4-one derivatives: A novel class of noncompetitive NR2C/D subunit-selective N-methyl-D-aspartate receptor antagonists. J Med Chem 53:5476-90 (2010)  
Target
Name:
Glutamate receptor ionotropic, NMDA 1/2A
Synonyms:
Glutamate NMDA receptor; Grin1/Grin2a | Glutamate [NMDA] receptor subunit epsilon 1/zeta 1
Type:
Mol. Mass.:
Description:
ASSAY_ID of EBI is 141020
Components:
This complex has 2 components.
Component 1
Name:
Glutamate receptor ionotropic, NMDA 2A
Synonyms:
Glutamate NMDA receptor; Grin1/Grin2a Grin2a NMDE1_RAT
Type:
Protein
Mol. Mass.:
165478.25
Organism:
Rattus norvegicus (Rat)
Description:
Q00959
Residue:
1464
  
Component 2
Name:
Glutamate receptor ionotropic, NMDA 1
Synonyms:
Glutamate (NMDA) receptor subunit zeta 1 Glutamate-NMDA-Channel Glutamate-NMDA-Polyamine NMDA Nmdar1 | phencyclidine
Type:
Enzyme Catalytic Domain
Mol. Mass.:
105533.40
Organism:
RAT
Description:
P35439
Residue:
938
  
Inhibitor
Name:
BDBM50324473
Synonyms:
(E)-3-(2-methoxyphenyl)-2-(2-nitrostyryl)quinazolin-4(3H)-one | CHEMBL1215007
Type:
Small organic molecule
Emp. Form.:
C23H17N3O4
Mol. Mass.:
399.3988
SMILES:
COc1ccccc1-n1c(\C=C\c2ccccc2[N+]([O-])=O)nc2ccccc2c1=O
: