Target
Transmembrane protease serine 6
Ligand
BDBM50324477
Substrate
Meas. Tech.
ChEMBL_649220 (CHEMBL1218918)
Ki
290±n/a nM
Citation
 Sisay, MTSteinmetzer, TStirnberg, MMaurer, EHammami, MBajorath, JGütschow, M Identification of the first low-molecular-weight inhibitors of matriptase-2. J Med Chem 53:5523-35 (2010)  
Target
Name:
Transmembrane protease serine 6
Synonyms:
Matriptase-2 TMPS6_HUMAN
Type:
PROTEIN
Mol. Mass.:
90001.12
Organism:
Homo sapiens (Human)
Description:
ChEMBL_1442547
Residue:
811
  
Inhibitor
Name:
BDBM50324477
Synonyms:
Benzylsulfonyl-D-cyclohexylalanyl-proline-(4-amidinobenzyl)-amide Trifluoroacetate CHEMBL1229261
Type:
Small organic molecule
Emp. Form.:
C29H39N5O4S
Mol. Mass.:
553.716
SMILES:
NC(=N)c1ccc(CNC(=O)[C@@H]2CCCN2C(=O)[C@@H](CC2CCCCC2)NS(=O)(=O)Cc2ccccc2)cc1
: