Target
Dipeptidyl peptidase 8
Ligand
BDBM50324497
Substrate
Meas. Tech.
ChEMBL_649273 (CHEMBL1218971)
Ki
1.1±n/a nM
Citation
 Meng, WBrigance, RPChao, HJFura, AHarrity, TMarcinkeviciene, JO'Connor, SPTamura, JKXie, DZhang, YKlei, HEKish, KWeigelt, CATurdi, HWang, AZahler, RKirby, MSHamann, LG Discovery of 6-(aminomethyl)-5-(2,4-dichlorophenyl)-7-methylimidazo[1,2-a]pyrimidine-2-carboxamides as potent, selective dipeptidyl peptidase-4 (DPP4) inhibitors. J Med Chem 53:5620-8 (2010)  
Target
Name:
Dipeptidyl peptidase 8
Synonyms:
DPP8 DPRP-1 Dipeptidyl peptidase 8 (DPP-8) Dipeptidyl peptidase 8/9 Dipeptidyl peptidase VIII Prolyl dipeptidase DPP8
Type:
Enzyme
Mol. Mass.:
103342.62
Organism:
Homo sapiens (Human)
Description:
Q6V1X1
Residue:
898
  
Inhibitor
Name:
BDBM50324497
Synonyms:
(6-(aminomethyl)-5-(2,4-dichlorophenyl)-7-methylimidazo[1,2-a]pyrimidin-2-yl)(4,4-dimethyloxazolidin-3-yl)methanone | CHEMBL1215164
Type:
Small organic molecule
Emp. Form.:
C20H21Cl2N5O2
Mol. Mass.:
434.319
SMILES:
Cc1nc2nc(cn2c(c1CN)-c1ccc(Cl)cc1Cl)C(=O)N1COCC1(C)C
: