Target
Lysine-specific demethylase 4C
Ligand
BDBM50324527
Substrate
Meas. Tech.
ChEMBL_649376 (CHEMBL1219074)
IC50
2000±n/a nM
Citation
 Hamada, SSuzuki, TMino, KKoseki, KOehme, FFlamme, IOzasa, HItoh, YOgasawara, DKomaarashi, HKato, ATsumoto, HNakagawa, HHasegawa, MSasaki, RMizukami, TMiyata, N Design, synthesis, enzyme-inhibitory activity, and effect on human cancer cells of a novel series of jumonji domain-containing protein 2 histone demethylase inhibitors. J Med Chem 53:5629-38 (2010)  
Target
Name:
Lysine-specific demethylase 4C
Synonyms:
GASC-1 protein Gene amplified in squamous cell carcinoma 1 protein JMJD2C Jumonji domain-containing protein 2C KDM4C_HUMAN | KIAA0780
Type:
Protein
Mol. Mass.:
119979.01
Organism:
Homo sapiens (Human)
Description:
Q9H3R0
Residue:
1056
  
Inhibitor
Name:
BDBM50324527
Synonyms:
4-[(8-Dimethylaminooctyl)-(hydroxyl)amino]-4-oxobutanoic Acid Hydrochloride | CHEMBL1215587
Type:
Small organic molecule
Emp. Form.:
C14H28N2O4
Mol. Mass.:
288.3831
SMILES:
CN(C)CCCCCCCCN(O)C(=O)CCC(O)=O
: