Target
Egl nine homolog 1
Ligand
BDBM50324535
Substrate
Meas. Tech.
ChEMBL_649379 (CHEMBL1219077)
IC50
>100000±n/a nM
Citation
 Hamada, SSuzuki, TMino, KKoseki, KOehme, FFlamme, IOzasa, HItoh, YOgasawara, DKomaarashi, HKato, ATsumoto, HNakagawa, HHasegawa, MSasaki, RMizukami, TMiyata, N Design, synthesis, enzyme-inhibitory activity, and effect on human cancer cells of a novel series of jumonji domain-containing protein 2 histone demethylase inhibitors. J Med Chem 53:5629-38 (2010)  
Target
Name:
Egl nine homolog 1
Synonyms:
C1orf12 EGLN1_HUMAN Hypoxia-inducible factor prolyl hydroxylase 2 (HIF-PH2) Prolyl hydroxylase domain-containing protein 2 (PHD2)
Type:
Protein
Mol. Mass.:
46035.59
Organism:
Homo sapiens (Human)
Description:
Q9GZT9
Residue:
426
  
Inhibitor
Name:
BDBM50324535
Synonyms:
3-{[9-(Dimethylamino)nonanoyl](hydroxy)amino}propanoicAcid Hydrochloride CHEMBL1229308
Type:
Small organic molecule
Emp. Form.:
C14H28N2O4
Mol. Mass.:
288.3831
SMILES:
CN(C)CCCCCCCCC(=O)N(O)CCC(O)=O
: