Target
5-hydroxytryptamine receptor 2A
Ligand
BDBM50324553
Substrate
Meas. Tech.
ChEMBL_649396 (CHEMBL1219094)
Ki
>10000±n/a nM
Citation
 Xiong, YUllman, BChoi, JSCherrier, MStrah-Pleynet, SDecaire, MDosa, PIFeichtinger, KTeegarden, BRFrazer, JMYoon, WHShan, YWhelan, KHauser, EKGrottick, AJSemple, GAl-Shamma, H Synthesis and in vivo evaluation of phenethylpiperazine amides: selective 5-hydroxytryptamine(2A) receptor antagonists for the treatment of insomnia. J Med Chem 53:5696-706 (2010)  
Target
Name:
5-hydroxytryptamine receptor 2A
Synonyms:
5-HT-2 5-HT2A 5-hydroxytryptamine receptor 2A (5HT-2A) 5HT2A_HUMAN HTR2A | Serotonin receptor 2A
Type:
undefined
Mol. Mass.:
52607.65
Organism:
Homo sapiens (Human)
Description:
P28223
Residue:
471
  
Inhibitor
Name:
BDBM50324553
Synonyms:
2-{2-[4-(4-Bromo-1-methyl-1H-pyrazole-3-carbonyl)piperazin-1-yl]ethyl}isoindoline-1,3-dione | CHEMBL1214730
Type:
Small organic molecule
Emp. Form.:
C19H20BrN5O3
Mol. Mass.:
446.298
SMILES:
Cn1cc(Br)c(n1)C(=O)N1CCN(CCN2C(=O)c3ccccc3C2=O)CC1
: