Target
5-hydroxytryptamine receptor 2C
Ligand
BDBM50324562
Substrate
Meas. Tech.
ChEMBL_649397 (CHEMBL1219095)
Ki
2933±n/a nM
Citation
 Xiong, YUllman, BChoi, JSCherrier, MStrah-Pleynet, SDecaire, MDosa, PIFeichtinger, KTeegarden, BRFrazer, JMYoon, WHShan, YWhelan, KHauser, EKGrottick, AJSemple, GAl-Shamma, H Synthesis and in vivo evaluation of phenethylpiperazine amides: selective 5-hydroxytryptamine(2A) receptor antagonists for the treatment of insomnia. J Med Chem 53:5696-706 (2010)  
Target
Name:
5-hydroxytryptamine receptor 2C
Synonyms:
5-HT-2C 5-HT2C-INI 5-HTR2C 5-hydroxytryptamine receptor 2C (5-HT-2C) 5HT-1C HTR1C Serotonin (5-HT3) receptor Serotonin Receptor 2C
Type:
G Protein-Coupled Receptor (GPCR)
Mol. Mass.:
51836.79
Organism:
Homo sapiens (Human)
Description:
P28335
Residue:
458
  
Inhibitor
Name:
BDBM50324562
Synonyms:
2-[4-(4-Bromo-1,5-dimethyl-1H-pyrazole-3-carbonyl)piperazin-1-yl]-1-(4-fluorophenyl)ethanone | CHEMBL1214878
Type:
Small organic molecule
Emp. Form.:
C18H20BrFN4O2
Mol. Mass.:
423.279
SMILES:
Cc1c(Br)c(nn1C)C(=O)N1CCN(CC(=O)c2ccc(F)cc2)CC1
: