Target
Cell division control protein 42 homolog
Ligand
BDBM50324673
Substrate
Meas. Tech.
ChEMBL_652970 (CHEMBL1226173)
IC50
7000±n/a nM
Citation
 Pelish, HEPeterson, JRSalvarezza, SBRodriguez-Boulan, EChen, JLStamnes, MMacia, EFeng, YShair, MDKirchhausen, T Secramine inhibits Cdc42-dependent functions in cells and Cdc42 activation in vitro. Nat Chem Biol 2:39-46 (2006)  
Target
Name:
Cell division control protein 42 homolog
Synonyms:
CDC42 Cell division control protein 42 homolog cell division cycle 42 (GTP binding protein, 25kDa)
Type:
PROTEIN
Mol. Mass.:
21258.36
Organism:
Homo sapiens (Human)
Description:
ChEMBL_652970
Residue:
191
  
Inhibitor
Name:
BDBM50324673
Synonyms:
CHEMBL1222039 | Secramine B
Type:
Small organic molecule
Emp. Form.:
C29H35BrN2O5S
Mol. Mass.:
603.568
SMILES:
CO\N=C1/C[C@H]2Oc3c4c(CN[C@H](CO)C[C@]24[C@@H](C1)SCc1ccc(OC)cc1)cc(OCC1CC1)c3Br
: