Target
Cystic fibrosis transmembrane conductance regulator
Ligand
BDBM50324734
Substrate
Meas. Tech.
ChEMBL_651185 (CHEMBL1227950)
IC50
800±n/a nM
Citation
 Tradtrantip, LSonawane, NDNamkung, WVerkman, AS Nanomolar potency pyrimido-pyrrolo-quinoxalinedione CFTR inhibitor reduces cyst size in a polycystic kidney disease model. J Med Chem 52:6447-55 (2009)  
Target
Name:
Cystic fibrosis transmembrane conductance regulator
Synonyms:
ABCC7 CFTR Channel conductance-controlling ATPase | cAMP-dependent chloride channel
Type:
Enzyme Catalytic Domain
Mol. Mass.:
168171.30
Organism:
Homo sapiens (Human)
Description:
gi_90421313
Residue:
1480
  
Inhibitor
Name:
BDBM50324734
Synonyms:
7,9-Dimethyl-6-(5-methyl-furan-2-yl)-11-phenyl-6,7-dihydro-5H-5,7,9,11a-tetraaza-benzo[a]fluorene-8,10-dione | CHEMBL1087004
Type:
Small organic molecule
Emp. Form.:
C26H22N4O3
Mol. Mass.:
438.4779
SMILES:
Cc1ccc(o1)C1Nc2ccccc2-n2c1c1n(C)c(=O)n(C)c(=O)c1c2-c1ccccc1
: