Target
Coagulation factor X
Ligand
BDBM50324758
Substrate
Meas. Tech.
ChEMBL_651359 (CHEMBL1227179)
Ki
10±n/a nM
Citation
 Anselm, LBanner, DWBenz, JZbinden, KGHimber, JHilpert, HHuber, WKuhn, BMary, JLOtteneder, MBPanday, NRicklin, FStahl, MThomi, SHaap, W Discovery of a factor Xa inhibitor (3R,4R)-1-(2,2-difluoro-ethyl)-pyrrolidine-3,4-dicarboxylic acid 3-[(5-chloro-pyridin-2-yl)-amide] 4-[[2-fluoro-4-(2-oxo-2H-pyridin-1-yl)-phenyl]-amide] as a clinical candidate. Bioorg Med Chem Lett 20:5313-9 (2010)  
Target
Name:
Coagulation factor X
Synonyms:
Activated coagulation factor X (FXa) Coagulation factor X precursor F10 Factor X heavy chain Factor Xa Stuart-Prower factor
Type:
Enzyme
Mol. Mass.:
54726.60
Organism:
Homo sapiens (Human)
Description:
Residue:
488
  
Inhibitor
Name:
BDBM50324758
Synonyms:
(3R,4R)-N3-(4-chlorophenyl)-N4-(2-fluoro-4-(2-oxopyridin-1(2H)-yl)phenyl)-1-(isopropylsulfonyl)pyrrolidine-3,4-dicarboxamide | CHEMBL1221674
Type:
Small organic molecule
Emp. Form.:
C26H26ClFN4O5S
Mol. Mass.:
561.025
SMILES:
CC(C)S(=O)(=O)N1C[C@@H]([C@H](C1)C(=O)Nc1ccc(cc1F)-n1ccccc1=O)C(=O)Nc1ccc(Cl)cc1
: