Target
Prostaglandin G/H synthase 1
Ligand
BDBM50324800
Substrate
Meas. Tech.
ChEMBL_651418 (CHEMBL1227391)
IC50
>100000±n/a nM
Citation
 Abdellatif, KRVelázquez, CAHuang, ZChowdhury, MAKnaus, EE Triaryl (Z)-olefins suitable for radiolabeling with carbon-11 or fluorine-18 radionuclides for positron emission tomography imaging of cyclooxygenase-2 expression in pathological disease. Bioorg Med Chem Lett 20:5245-50 (2010)  
Target
Name:
Prostaglandin G/H synthase 1
Synonyms:
COX1 Cyclooxygenase-1 (COX-1) PTGS1 | Prostaglandin G/H synthase (cyclooxygenase)
Type:
Protein
Mol. Mass.:
68868.60
Organism:
Ovis aries (Sheep)
Description:
Residue:
600
  
Inhibitor
Name:
BDBM50324800
Synonyms:
1-methoxy-4-(2-(4-(methylsulfonyl)phenyl)-1-phenylbut-1-enyl)benzene | CHEMBL1221727
Type:
Small organic molecule
Emp. Form.:
C24H24O3S
Mol. Mass.:
392.511
SMILES:
CC\C(=C(/c1ccccc1)c1ccc(OC)cc1)c1ccc(cc1)S(C)(=O)=O
: