Target
5-hydroxytryptamine receptor 2A
Ligand
BDBM50324862
Substrate
Meas. Tech.
ChEMBL_651487 (CHEMBL1227604)
IC50
1423±n/a nM
Citation
 Park, CMKim, SYPark, WKChoi, JHSeong, CM Synthesis and SAR of (piperazin-1-yl-phenyl)-arylsulfonamides: a novel series of atypical antipsychotic agents. Bioorg Med Chem Lett 20:5221-4 (2010)  
Target
Name:
5-hydroxytryptamine receptor 2A
Synonyms:
5-HT-2 5-HT2A 5-hydroxytryptamine receptor 2A (5HT-2A) 5HT2A_HUMAN HTR2A | Serotonin receptor 2A
Type:
undefined
Mol. Mass.:
52607.65
Organism:
Homo sapiens (Human)
Description:
P28223
Residue:
471
  
Inhibitor
Name:
BDBM50324862
Synonyms:
CHEMBL1222362 | naphthalene-2-sulfonic acid methyl-[3-(4-methyl-piperazin-1-yl)-phenyl]-amide
Type:
Small organic molecule
Emp. Form.:
C22H25N3O2S
Mol. Mass.:
395.518
SMILES:
CN(c1cccc(c1)N1CCN(C)CC1)S(=O)(=O)c1ccc2ccccc2c1
: