Target
5-hydroxytryptamine receptor 7
Ligand
BDBM50324862
Substrate
Meas. Tech.
ChEMBL_651488 (CHEMBL1227605)
IC50
4425±n/a nM
Citation
 Park, CMKim, SYPark, WKChoi, JHSeong, CM Synthesis and SAR of (piperazin-1-yl-phenyl)-arylsulfonamides: a novel series of atypical antipsychotic agents. Bioorg Med Chem Lett 20:5221-4 (2010)  
Target
Name:
5-hydroxytryptamine receptor 7
Synonyms:
5-HT-7 5-HT7 5-HT7S 5HT7 HTR7 | Serotonin receptor 7
Type:
G Protein-Coupled Receptor (GPCR)
Mol. Mass.:
53573.08
Organism:
Homo sapiens (Human)
Description:
P34969
Residue:
479
  
Inhibitor
Name:
BDBM50324862
Synonyms:
CHEMBL1222362 | naphthalene-2-sulfonic acid methyl-[3-(4-methyl-piperazin-1-yl)-phenyl]-amide
Type:
Small organic molecule
Emp. Form.:
C22H25N3O2S
Mol. Mass.:
395.518
SMILES:
CN(c1cccc(c1)N1CCN(C)CC1)S(=O)(=O)c1ccc2ccccc2c1
: