Target
Caspase-1
Ligand
BDBM10355
Substrate
Meas. Tech.
ChEMBL_651546 (CHEMBL1227798)
Ki
9±n/a nM
Citation
 Galatsis, PCaprathe, BGilmore, JThomas, ALinn, KSheehan, SHarter, WKostlan, CLunney, EStankovic, CRubin, JBrady, KAllen, HTalanian, R Succinic acid amides as P2-P3 replacements for inhibitors of interleukin-1beta converting enzyme (ICE or caspase 1). Bioorg Med Chem Lett 20:5184-90 (2010)  
Target
Name:
Caspase-1
Synonyms:
CASP1_MOUSE Il1bc
Type:
PROTEIN
Mol. Mass.:
45636.44
Organism:
Mus musculus
Description:
ChEMBL_651546
Residue:
402
  
Inhibitor
Name:
BDBM10355
Synonyms:
(3S)-3-[(2S)-2-[(2S)-2-[(2S)-2-acetamido-3-(4-hydroxyphenyl)propanamido]-3-methylbutanamido]propanamido]-4-oxobutanoic acid CHEMBL37630
Type:
Small organic molecule
Emp. Form.:
C23H32N4O8
Mol. Mass.:
492.5222
SMILES:
CC(C)[C@H](NC(=O)[C@H](Cc1ccc(O)cc1)NC(C)=O)C(=O)N[C@@H](C)C(=O)N[C@@H](CC(O)=O)C=O
: