Target
Histamine H3 receptor
Ligand
BDBM50325065
Substrate
Meas. Tech.
ChEMBL_651627 (CHEMBL1228010)
IC50
0.4±n/a nM
Citation
 Davenport, AJStimson, CCCorsi, MVaidya, DGlenn, EJones, TDBailey, SGemkow, MJFritz, UHallett, DJ Discovery of substituted benzyl tetrazoles as histamine H3 receptor antagonists. Bioorg Med Chem Lett 20:5165-9 (2010)  
Target
Name:
Histamine H3 receptor
Synonyms:
G-protein coupled receptor 97 HH3R HRH3 Histamine H3 receptor (H3) Histamine receptor (H3 and H4)
Type:
G Protein-Coupled Receptor (GPCR)
Mol. Mass.:
48691.47
Organism:
Homo sapiens (Human)
Description:
Binding assays were using CHO cells stably expressing hH3R receptors.
Residue:
445
  
Inhibitor
Name:
BDBM50325065
Synonyms:
1-((1-benzyl-1H-tetrazol-5-yl)(4-((4-methylpiperazin-1-yl)methyl)phenyl)methyl)-4-cyclobutyl-1,4-diazepane | CHEMBL1223158
Type:
Small organic molecule
Emp. Form.:
C30H42N8
Mol. Mass.:
514.7081
SMILES:
CN1CCN(Cc2ccc(cc2)C(N2CCCN(CC2)C2CCC2)c2nnnn2Cc2ccccc2)CC1
: