Target
Steroid 17-alpha-hydroxylase/17,20 lyase
Ligand
BDBM50188092
Substrate
Meas. Tech.
ChEMBL_652121 (CHEMBL1228230)
IC50
730±n/a nM
Citation
 Owen, CPShahid, ILee, WYAhmed, S Synthesis and biochemical evaluation of a range of (4-substituted phenyl)sulfonate derivatives of 4-hydroxybenzyl imidazole-based compounds as potent inhibitors of 17alpha-hydroxylase/17,20-lyase (P45017alpha) derived from rat testicular microsomes. Bioorg Med Chem Lett 20:5345-8 (2010)  
Target
Name:
Steroid 17-alpha-hydroxylase/17,20 lyase
Synonyms:
CP17A_RAT Cyp17a1 Cytochrome P450 17A1 Steroid 17-alpha-hydroxylase/17,20 lyase
Type:
Enzyme
Mol. Mass.:
57255.68
Organism:
Rattus norvegicus (Rat)
Description:
P11715
Residue:
507
  
Inhibitor
Name:
BDBM50188092
Synonyms:
1-(4-iodobenzyl)-1H-imidazole CHEMBL427399
Type:
Small organic molecule
Emp. Form.:
C10H9IN2
Mol. Mass.:
284.0963
SMILES:
Ic1ccc(Cn2ccnc2)cc1
: