Target
Collagenase 3
Ligand
BDBM50325338
Substrate
Meas. Tech.
ChEMBL_652122 (CHEMBL1228231)
IC50
2±n/a nM
Citation
 Gao, DAXiong, ZHeim-Riether, AAmodeo, LAugust, EMCao, XCiccarelli, LCollins, BKHarrington, KHaverty, KHill-Drzewi, MLi, XLiang, SMargarit, SMMoss, NNagaraja, NProudfoot, JRoman, RSchlyer, SKeenan, LSTaylor, SWellenzohn, BWiedenmayer, DLi, JFarrow, NA SAR studies of non-zinc-chelating MMP-13 inhibitors: improving selectivity and metabolic stability. Bioorg Med Chem Lett 20:5039-43 (2010)  
Target
Name:
Collagenase 3
Synonyms:
MMP-13 MMP13_HUMAN Matrix metalloproteinase-13 (MMP-13) | Matrix metalloproteinase-13 (MMP13)
Type:
Enzyme
Mol. Mass.:
53808.06
Organism:
Homo sapiens (Human)
Description:
P45452
Residue:
471
  
Inhibitor
Name:
BDBM50325338
Synonyms:
(S)-N-(3-(5-(2-(methylamino)-2-oxo-1-(tetrahydro-2H-pyran-4-yl)ethylcarbamoyl)furan-2-yl)benzyl)-6-(trifluoromethyl)picolinamide | CHEMBL1223490
Type:
Small organic molecule
Emp. Form.:
C27H27F3N4O5
Mol. Mass.:
544.5223
SMILES:
CNC(=O)[C@@H](NC(=O)c1ccc(o1)-c1cccc(CNC(=O)c2cccc(n2)C(F)(F)F)c1)C1CCOCC1
: