Target
Cyclin-dependent kinase 2
Ligand
BDBM50325375
Substrate
Meas. Tech.
ChEMBL_652136 (CHEMBL1228245)
IC50
>100000±n/a nM
Citation
 Shimizu, HTanaka, SToki, TYasumatsu, IAkimoto, TMorishita, KYamasaki, TYasukochi, TIimura, S Discovery of imidazo[1,2-b]pyridazine derivatives as IKKbeta inhibitors. Part 1: Hit-to-lead study and structure-activity relationship. Bioorg Med Chem Lett 20:5113-8 (2010)  
Target
Name:
Cyclin-dependent kinase 2
Synonyms:
CDK2 CDK2_HUMAN Cell division protein kinase 2 Protein cereblon/Cyclin-dependent kinase 2 | p33 protein kinase
Type:
Enzyme Subunit
Mol. Mass.:
33938.17
Organism:
Homo sapiens (Human)
Description:
P24941
Residue:
298
  
Inhibitor
Name:
BDBM50325375
Synonyms:
(S)-4-(6-(cyclopropylmethylamino)imidazo[1,2-b]pyridazin-3-yl)-N-(pyrrolidin-2-ylmethyl)benzamide | CHEMBL1222990
Type:
Small organic molecule
Emp. Form.:
C22H26N6O
Mol. Mass.:
390.4814
SMILES:
O=C(NC[C@@H]1CCCN1)c1ccc(cc1)-c1cnc2ccc(NCC3CC3)nn12
: