Target
Insulin-like growth factor 1 receptor
Ligand
BDBM50325430
Substrate
Meas. Tech.
ChEMBL_652152 (CHEMBL1228261)
IC50
40±n/a nM
Citation
 Sampognaro, AJWittman, MDCarboni, JMChang, CGreer, AFHurlburt, WWSack, JSVyas, DM Proline isosteres in a series of 2,4-disubstituted pyrrolo[1,2-f][1,2,4]triazine inhibitors of IGF-1R kinase and IR kinase. Bioorg Med Chem Lett 20:5027-30 (2010)  
Target
Name:
Insulin-like growth factor 1 receptor
Synonyms:
CD_antigen=CD221 IGF1R Insulin-like growth factor 1 receptor (IGF1R) Insulin-like growth factor 1 receptor alpha chain Insulin-like growth factor I receptor | Insulin-like growth factor receptor (IGFR)
Type:
Protein
Mol. Mass.:
154776.79
Organism:
Homo sapiens (Human)
Description:
P08069
Residue:
1367
  
Inhibitor
Name:
BDBM50325430
Synonyms:
CHEMBL1222855 N-({4-[(3-cyclopropyl-1H-pyrazol-5-yl)amino]pyrrolo[2,1-f][1,2,4]triazin-2-yl}methyl)-6-fluoropyridine-3-carboxamide
Type:
Small organic molecule
Emp. Form.:
C19H17FN8O
Mol. Mass.:
392.3897
SMILES:
Fc1ccc(cn1)C(=O)NCc1nc(Nc2cc(n[nH]2)C2CC2)c2cccn2n1
: