Target
Histamine H3 receptor
Ligand
BDBM50325449
Substrate
Meas. Tech.
ChEMBL_652205 (CHEMBL1228478)
Ki
0.15±n/a nM
Citation
 Ting, PCLee, JFAlbanese, MMWu, JAslanian, RFavreau, LNardo, CKorfmacher, WAWest, REWilliams, SMAnthes, JCRivelli, MACorboz, MRHey, JA The synthesis and structure-activity relationship of 4-benzimidazolyl-piperidinylcarbonyl-piperidine analogs as histamine H3 antagonists. Bioorg Med Chem Lett 20:5004-8 (2010)  
Target
Name:
Histamine H3 receptor
Synonyms:
HISTAMINE H3 HRH3_CAVPO | Histamine H3 receptor
Type:
Enzyme Catalytic Domain
Mol. Mass.:
48753.61
Organism:
GUINEA PIG
Description:
HISTAMINE H3 HRH3 GUINEA PIG::Q9JI35
Residue:
445
  
Inhibitor
Name:
BDBM50325449
Synonyms:
1-(2-(piperidin-1-yl)ethyl)-3-(1-(1-(pyridin-4-ylmethyl)piperidine-4-carbonyl)piperidin-4-yl)-1H-benzo[d]imidazol-2(3H)-one | CHEMBL1222863
Type:
Small organic molecule
Emp. Form.:
C31H42N6O2
Mol. Mass.:
530.7042
SMILES:
O=C(C1CCN(Cc2ccncc2)CC1)N1CCC(CC1)n1c2ccccc2n(CCN2CCCCC2)c1=O
: