Target
Cytochrome P450 2D6
Ligand
BDBM50325465
Substrate
Meas. Tech.
ChEMBL_652209 (CHEMBL1228482)
IC50
9100±n/a nM
Citation
 Ting, PCLee, JFAlbanese, MMWu, JAslanian, RFavreau, LNardo, CKorfmacher, WAWest, REWilliams, SMAnthes, JCRivelli, MACorboz, MRHey, JA The synthesis and structure-activity relationship of 4-benzimidazolyl-piperidinylcarbonyl-piperidine analogs as histamine H3 antagonists. Bioorg Med Chem Lett 20:5004-8 (2010)  
Target
Name:
Cytochrome P450 2D6
Synonyms:
CP2D6_HUMAN CYP2DL1 Cytochrome P450 2D6 (CYP2D6) P450-DB1
Type:
Protein
Mol. Mass.:
55774.82
Organism:
Homo sapiens (Human)
Description:
P10635
Residue:
497
  
Inhibitor
Name:
BDBM50325465
Synonyms:
1-benzyl-3-(1-(1-(pyridin-4-ylmethyl)piperidine-4-carbonyl)piperidin-4-yl)-1H-benzo[d]imidazol-2(3H)-one | CHEMBL1222938
Type:
Small organic molecule
Emp. Form.:
C31H35N5O2
Mol. Mass.:
509.6419
SMILES:
O=C(C1CCN(Cc2ccncc2)CC1)N1CCC(CC1)n1c2ccccc2n(Cc2ccccc2)c1=O
: